Reaction Details
TargetD(2) dopamine receptor
LigandBDBM50061559
Substrate/Competitorn/a
Meas. Tech.ChEMBL_61418 (CHEMBL675886)
IC50 31±n/a nM
Citation Liao, YVenhuis, BJRodenhuis, NTimmerman, WWikström, HMeier, EBartoszyk, GDBöttcher, HSeyfried, CASundell, S New (sulfonyloxy)piperazinyldibenzazepines as potential atypical antipsychotics: chemistry and pharmacological evaluation. J Med Chem42:2235-44 (1999) 
 
D(2) dopamine receptor
Name:D(2) dopamine receptor
Type:G Protein-Coupled Receptor (GPCR)
Mol. Mass.:50931.60
Organism:Rattus norvegicus (rat)
Description:P61169
Residue:444
BDBM50061559
NameBDBM50061559
Synonyms:CHEMBL72292 | Trifluoro-methanesulfonic acid 11-(4-methyl-piperazin-1-yl)-5H-dibenzo[b,e][1,4]diazepin-2-yl ester
TypeSmall organic molecule
Emp. Form.C19H19F3N4O3S
Mol. Mass.440.439
SMILESCN1CCN(CC1)C1=Nc2ccccc2Nc2ccc(OS(=O)(=O)C(F)(F)F)cc12