Reaction Details
TargetD(3) dopamine receptor
LigandBDBM50078063
Substrate/Competitorn/a
Meas. Tech.ChEMBL_61972 (CHEMBL670577)
IC50 52±n/a nM
Citation Liao, YVenhuis, BJRodenhuis, NTimmerman, WWikström, HMeier, EBartoszyk, GDBöttcher, HSeyfried, CASundell, S New (sulfonyloxy)piperazinyldibenzazepines as potential atypical antipsychotics: chemistry and pharmacological evaluation. J Med Chem42:2235-44 (1999) 
 
D(3) dopamine receptor
Name:D(3) dopamine receptor
Type:n/a
Mol. Mass.:44243.43
Organism:Homo sapiens (Human)
Description:n/a
Residue:400
BDBM50078063
NameBDBM50078063
Synonyms:CHEMBL70319 | Trifluoro-methanesulfonic acid 8-chloro-11-(4-methyl-piperazin-1-yl)-5H-dibenzo[b,e][1,4]diazepin-2-yl ester
TypeSmall organic molecule
Emp. Form.C19H18ClF3N4O3S
Mol. Mass.474.884
SMILESCN1CCN(CC1)C1=Nc2cc(Cl)ccc2Nc2ccc(OS(=O)(=O)C(F)(F)F)cc12