Reaction Details
Target5-hydroxytryptamine receptor 2A
LigandBDBM50061559
Substrate/Competitorn/a
Meas. Tech.ChEMBL_2584 (CHEMBL617605)
IC50 43±n/a nM
Citation Liao, YVenhuis, BJRodenhuis, NTimmerman, WWikström, HMeier, EBartoszyk, GDBöttcher, HSeyfried, CASundell, S New (sulfonyloxy)piperazinyldibenzazepines as potential atypical antipsychotics: chemistry and pharmacological evaluation. J Med Chem42:2235-44 (1999) 
 
5-hydroxytryptamine receptor 2A
Name:5-hydroxytryptamine receptor 2A
Type:G Protein-Coupled Receptor (GPCR)
Mol. Mass.:52852.05
Organism:Rattus norvegicus (rat)
Description:Rat cortex membranes 5-HT2A receptors.
Residue:471
BDBM50061559
NameBDBM50061559
Synonyms:CHEMBL72292 | Trifluoro-methanesulfonic acid 11-(4-methyl-piperazin-1-yl)-5H-dibenzo[b,e][1,4]diazepin-2-yl ester
TypeSmall organic molecule
Emp. Form.C19H19F3N4O3S
Mol. Mass.440.439
SMILESCN1CCN(CC1)C1=Nc2ccccc2Nc2ccc(OS(=O)(=O)C(F)(F)F)cc12