Reaction Details
TargetPurine nucleoside phosphorylase
LigandBDBM50039544
Substrate/Competitorn/a
Meas. Tech.ChEMBL_162028 (CHEMBL873419)
Ki 3.5±n/a nM
Citation Farutin, VMasterson, LAndricopulo, ADCheng, JRiley, BHakimi, RFrazer, JWCordes, EH Structure-activity relationships for a class of inhibitors of purine nucleoside phosphorylase. J Med Chem42:2422-31 (1999) 
 
Purine nucleoside phosphorylase
Name:Purine nucleoside phosphorylase
Type:Enzyme
Mol. Mass.:32035.18
Organism:Bos taurus (bovine)
Description:n/a
Residue:289
BDBM50039544
NameBDBM50039544
Synonyms:2-Amino-7-thiophen-3-ylmethyl-3,5-dihydro-pyrrolo[3,2-d]pyrimidin-4-one | CHEMBL79784
TypeSmall organic molecule
Emp. Form.C11H10N4OS
Mol. Mass.246.288
SMILESNc1nc2c(Cc3ccsc3)c[nH]c2c(=O)[nH]1