Reaction Details
TargetPurine nucleoside phosphorylase
LigandBDBM50039547
Substrate/Competitorn/a
Meas. Tech.ChEMBL_162028 (CHEMBL873419)
Ki 3.6±n/a nM
Citation Farutin, VMasterson, LAndricopulo, ADCheng, JRiley, BHakimi, RFrazer, JWCordes, EH Structure-activity relationships for a class of inhibitors of purine nucleoside phosphorylase. J Med Chem42:2422-31 (1999) 
 
Purine nucleoside phosphorylase
Name:Purine nucleoside phosphorylase
Type:Enzyme
Mol. Mass.:32035.18
Organism:Bos taurus (bovine)
Description:n/a
Residue:289
BDBM50039547
NameBDBM50039547
Synonyms:2-Amino-7-benzyl-3,5-dihydro-pyrrolo[3,2-d]pyrimidin-4-one CHEMBL310202
TypeSmall organic molecule
Emp. Form.C13H12N4O
Mol. Mass.240.2606
SMILESNc1nc2c(Cc3ccccc3)c[nH]c2c(=O)[nH]1