Reaction Details
Target5'-nucleotidase
LigandBDBM18136
Substrate/Competitorn/a
Meas. Tech.ChEMBL_1890511 (CHEMBL4392265)
Ki 167±n/a nM
Citation Junker, ARenn, CDobelmann, CNamasivayam, VJain, SLosenkova, KIrjala, HDuca, SBalasubramanian, RChakraborty, SBörgel, FZimmermann, HYegutkin, GGMüller, CEJacobson, KA Structure-Activity Relationship of Purine and Pyrimidine Nucleotides as Ecto-5'-Nucleotidase (CD73) Inhibitors. J Med Chem62:3677-3695 (2019) 
 
5'-nucleotidase
Name:5'-nucleotidase
Type:Enzyme
Mol. Mass.:63971.44
Organism:Rattus norvegicus (Rat)
Description:P21588
Residue:576
BDBM18136
NameBDBM18136
Synonyms:ADP, alpha beta-me [({[(2R,3S,4R,5R)-5-(6-amino-9H-purin-9-yl)-3,4-dihydroxyoxolan-2-yl]methoxy}(hydroxy)phosphoryl)methyl]phosphonic acid cid_92199
TypeNucleoside or nucleotide
Emp. Form.C11H17N5O9P2
Mol. Mass.425.2283
SMILESNc1ncnc2n(cnc12)[C@@H]1O[C@H](COP(O)(=O)CP(O)(O)=O)[C@@H](O)[C@H]1O