Reaction Details
TargetVasopressin V1b receptor
LigandBDBM50044777
Substrate/Competitorn/a
Meas. Tech.ChEMBL_1890528 (CHEMBL4392282)
EC50 0.003500±n/a nM
Citation Ichinose, WCherepanov, SMShabalova, AAYokoyama, SYuhi, TYamaguchi, HWatanabe, AYamamoto, YOkamoto, HHorike, STerakawa, JDaikoku, TWatanabe, MMano, NHigashida, HShuto, S Development of a Highly Potent Analogue and a Long-Acting Analogue of Oxytocin for the Treatment of Social Impairment-Like Behaviors. J Med Chem62:3297-3310 (2019) 
 
Vasopressin V1b receptor
Name:Vasopressin V1b receptor
Type:Enzyme
Mol. Mass.:46985.01
Organism:Homo sapiens (Human)
Description:P47901
Residue:424
BDBM50044777
NameBDBM50044777
Synonyms:Arginine Vasopressin CHEBI:34543 Pitressin Vasopressin
TypeSmall organic molecule
Emp. Form.C46H65N15O12S2
Mol. Mass.1084.232
SMILESN[C@H]1CSSC[C@H](NC(=O)[C@H](CC(N)=O)NC(=O)[C@H](CCC(N)=O)NC(=O)[C@H](Cc2ccccc2)NC(=O)[C@H](Cc2ccc(O)cc2)NC1=O)C(=O)N1CCC[C@H]1C(=O)N[C@@H](CCCNC(N)=N)C(=O)NCC(N)=O