Reaction Details
TargetVasopressin V1b receptor
LigandBDBM50044742
Substrate/Competitorn/a
Meas. Tech.ChEMBL_1890528 (CHEMBL4392282)
EC50 7.7±n/a nM
Citation Ichinose, WCherepanov, SMShabalova, AAYokoyama, SYuhi, TYamaguchi, HWatanabe, AYamamoto, YOkamoto, HHorike, STerakawa, JDaikoku, TWatanabe, MMano, NHigashida, HShuto, S Development of a Highly Potent Analogue and a Long-Acting Analogue of Oxytocin for the Treatment of Social Impairment-Like Behaviors. J Med Chem62:3297-3310 (2019) 
 
Vasopressin V1b receptor
Name:Vasopressin V1b receptor
Type:Enzyme
Mol. Mass.:46985.01
Organism:Homo sapiens (Human)
Description:P47901
Residue:424
BDBM50044742
NameBDBM50044742
Synonyms:CHEMBL3354579
TypeSmall organic molecule
Emp. Form.C44H69N11O13S
Mol. Mass.992.15
SMILES[H][C@]1(NC(=O)[C@H](Cc2ccc(O)cc2)NC(=O)CCCSC[C@H](NC(=O)[C@H](CC(N)=O)NC(=O)[C@H](CCC(N)=O)NC1=O)C(=O)N(CCCO)CC(=O)N[C@@H](CC(C)C)C(=O)NCC(N)=O)[C@@H](C)CC