Reaction Details
TargetVasopressin V1b receptor
LigandBDBM50523554
Substrate/Competitorn/a
Meas. Tech.ChEMBL_1890528 (CHEMBL4392282)
EC50>10.0±n/a nM
Citation Ichinose, WCherepanov, SMShabalova, AAYokoyama, SYuhi, TYamaguchi, HWatanabe, AYamamoto, YOkamoto, HHorike, STerakawa, JDaikoku, TWatanabe, MMano, NHigashida, HShuto, S Development of a Highly Potent Analogue and a Long-Acting Analogue of Oxytocin for the Treatment of Social Impairment-Like Behaviors. J Med Chem62:3297-3310 (2019) 
 
Vasopressin V1b receptor
Name:Vasopressin V1b receptor
Type:Enzyme
Mol. Mass.:46985.01
Organism:Homo sapiens (Human)
Description:P47901
Residue:424
BDBM50523554
NameBDBM50523554
Synonyms:CHEMBL4467042
TypeSmall organic molecule
Emp. Form.C44H70N12O13S
Mol. Mass.1007.164
SMILESCC[C@H](C)[C@@H]1NC(=O)[C@H](Cc2ccc(O)cc2)NC(=O)[C@@H](N)CCSC[C@H](NC(=O)[C@H](CC(N)=O)NC(=O)[C@H](CCC(N)=O)NC1=O)C(=O)N(CCCO)CC(=O)N[C@@H](CC(C)C)C(=O)NCC(N)=O