Reaction Details
TargetAcetylcholinesterase
LigandBDBM50523570
Substrate/Competitorn/a
Meas. Tech.ChEMBL_1890733 (CHEMBL4392487)
IC50 2010±n/a nM
Citation Arumugam, NAlmansour, AIKumar, RSKotresha, DSaiswaroop, RVenketesh, S Dispiropyrrolidinyl-piperidone embedded indeno[1,2-b]quinoxaline heterocyclic hybrids: Synthesis, cholinesterase inhibitory activity and their molecular docking simulation. Bioorg Med Chem27:2621-2628 (2019) 
 
Acetylcholinesterase
Name:Acetylcholinesterase
Type:Enzyme
Mol. Mass.:71812.79
Organism:Electrophorus electricus (Electric eel)
Description:n/a
Residue:633
BDBM50523570
NameBDBM50523570
Synonyms:CHEMBL4436182
TypeSmall organic molecule
Emp. Form.C44H35N7O5
Mol. Mass.741.7926
SMILES[O-][N+](=O)c1cccc(\C=C2/CNCC3(C(C(Cc4c[nH]c5ccccc45)NC33C4N=c5ccccc5=NC4c4ccccc34)c3cccc(c3)[N+]([O-])=O)C2=O)c1