Reaction Details
TargetCholinesterase
LigandBDBM50523571
Substrate/Competitorn/a
Meas. Tech.ChEMBL_1890732 (CHEMBL4392486)
IC50 12400±n/a nM
Citation Arumugam, NAlmansour, AIKumar, RSKotresha, DSaiswaroop, RVenketesh, S Dispiropyrrolidinyl-piperidone embedded indeno[1,2-b]quinoxaline heterocyclic hybrids: Synthesis, cholinesterase inhibitory activity and their molecular docking simulation. Bioorg Med Chem27:2621-2628 (2019) 
 
Cholinesterase
Name:Cholinesterase
Type:Enzyme
Mol. Mass.:65643.35
Organism:Equus caballus (Horse)
Description:P81908
Residue:574
BDBM50523571
NameBDBM50523571
Synonyms:CHEMBL4522515
TypeSmall organic molecule
Emp. Form.C46H41N5O
Mol. Mass.679.8506
SMILESCc1ccc(\C=C2/CNCC3(C(C(Cc4c[nH]c5ccccc45)NC33C4N=c5ccccc5=NC4c4ccccc34)c3ccc(C)cc3)C2=O)cc1