Reaction Details
TargetAcetylcholinesterase
LigandBDBM50523574
Substrate/Competitorn/a
Meas. Tech.ChEMBL_1890733 (CHEMBL4392487)
IC50 10200±n/a nM
Citation Arumugam, NAlmansour, AIKumar, RSKotresha, DSaiswaroop, RVenketesh, S Dispiropyrrolidinyl-piperidone embedded indeno[1,2-b]quinoxaline heterocyclic hybrids: Synthesis, cholinesterase inhibitory activity and their molecular docking simulation. Bioorg Med Chem27:2621-2628 (2019) 
 
Acetylcholinesterase
Name:Acetylcholinesterase
Type:Enzyme
Mol. Mass.:71812.79
Organism:Electrophorus electricus (Electric eel)
Description:n/a
Residue:633
BDBM50523574
NameBDBM50523574
Synonyms:CHEMBL4562781
TypeSmall organic molecule
Emp. Form.C44H33Cl4N5O
Mol. Mass.789.578
SMILESClc1ccc(\C=C2/CNCC3(C(C(Cc4c[nH]c5ccccc45)NC33C4N=c5ccccc5=NC4c4ccccc34)c3ccc(Cl)cc3Cl)C2=O)c(Cl)c1