Reaction Details
TargetAcetylcholinesterase
LigandBDBM50523578
Substrate/Competitorn/a
Meas. Tech.ChEMBL_1890733 (CHEMBL4392487)
IC50 15250±n/a nM
Citation Arumugam, NAlmansour, AIKumar, RSKotresha, DSaiswaroop, RVenketesh, S Dispiropyrrolidinyl-piperidone embedded indeno[1,2-b]quinoxaline heterocyclic hybrids: Synthesis, cholinesterase inhibitory activity and their molecular docking simulation. Bioorg Med Chem27:2621-2628 (2019) 
 
Acetylcholinesterase
Name:Acetylcholinesterase
Type:Enzyme
Mol. Mass.:71812.79
Organism:Electrophorus electricus (Electric eel)
Description:n/a
Residue:633
BDBM50523578
NameBDBM50523578
Synonyms:CHEMBL4464716
TypeSmall organic molecule
Emp. Form.C44H35Br2N5O
Mol. Mass.809.59
SMILESBrc1ccc(\C=C2/CNCC3(C(C(Cc4c[nH]c5ccccc45)NC33C4N=c5ccccc5=NC4c4ccccc34)c3ccc(Br)cc3)C2=O)cc1