Reaction Details
TargetAcetylcholinesterase
LigandBDBM50523579
Substrate/Competitorn/a
Meas. Tech.ChEMBL_1890733 (CHEMBL4392487)
IC50 5800±n/a nM
Citation Arumugam, NAlmansour, AIKumar, RSKotresha, DSaiswaroop, RVenketesh, S Dispiropyrrolidinyl-piperidone embedded indeno[1,2-b]quinoxaline heterocyclic hybrids: Synthesis, cholinesterase inhibitory activity and their molecular docking simulation. Bioorg Med Chem27:2621-2628 (2019) 
 
Acetylcholinesterase
Name:Acetylcholinesterase
Type:Enzyme
Mol. Mass.:71812.79
Organism:Electrophorus electricus (Electric eel)
Description:n/a
Residue:633
BDBM50523579
NameBDBM50523579
Synonyms:CHEMBL4473000
TypeSmall organic molecule
Emp. Form.C46H41N5O
Mol. Mass.679.8506
SMILESCc1ccccc1\C=C1/CNCC2(C(C(Cc3c[nH]c4ccccc34)NC22C3N=c4ccccc4=NC3c3ccccc23)c2ccccc2C)C1=O