Reaction Details
TargetCholinesterase
LigandBDBM50523572
Substrate/Competitorn/a
Meas. Tech.ChEMBL_1890732 (CHEMBL4392486)
IC50 14220±n/a nM
Citation Arumugam, NAlmansour, AIKumar, RSKotresha, DSaiswaroop, RVenketesh, S Dispiropyrrolidinyl-piperidone embedded indeno[1,2-b]quinoxaline heterocyclic hybrids: Synthesis, cholinesterase inhibitory activity and their molecular docking simulation. Bioorg Med Chem27:2621-2628 (2019) 
 
Cholinesterase
Name:Cholinesterase
Type:Enzyme
Mol. Mass.:65643.35
Organism:Equus caballus (Horse)
Description:P81908
Residue:574
BDBM50523572
NameBDBM50523572
Synonyms:CHEMBL4549715
TypeSmall organic molecule
Emp. Form.C44H37N5O
Mol. Mass.651.7975
SMILESO=C1\C(CNCC11C(C(Cc2c[nH]c3ccccc23)NC11C2N=c3ccccc3=NC2c2ccccc12)c1ccccc1)=C\c1ccccc1