Reaction Details
TargetIntegrin alpha-V/beta-3
LigandBDBM50078716
Substrate/Competitorn/a
Meas. Tech.ChEBML_214764
Ki 550±n/a nM
Citation Miller, WHBondinell, WECousins, RDErhard, KFJakas, DRKeenan, RMKu, TWNewlander, KARoss, STHaltiwanger, RCBradbeer, JDrake, FHGowen, MHoffman, SJHwang, SMJames, IELark, MWLechowska, BRieman, DJStroup, GBVasko-Moser, JAZembryki, DLAzzarano, LMAdams, PCHuffman, WF Orally bioavailable nonpeptide vitronectin receptor antagonists with efficacy in an osteoporosis model. Bioorg Med Chem Lett9:1807-12 (1999) Integrin alpha-V/beta-3
Name:Integrin alpha-V/beta-3
Type:Enzyme
Mol. Mass.:n/a
Description:n/a
Components:This complex has 2 components.
Component 1
Name:Integrin alpha-V
Synonyms:ITAV_HUMAN Integrin alpha-V/alpha-5 VNRA Vitronectin receptor | Vitronectin receptor subunit alpha
Type:PROTEIN
Mol. Mass.:116024.92
Organism:Homo sapiens (Human)
Description:ChEMBL_582336
Residue:1048
Component 2
Name:Integrin beta-3
Synonyms:CD_antigen=CD61 GPIIIa ITGB3 Platelet membrane glycoprotein IIIa
Type:Protein
Mol. Mass.:87038.91
Organism:Homo sapiens (Human)
Description:P05106
Residue:788
BDBM50078716
NameBDBM50078716
Synonyms:CHEMBL52464 | {(R)-3-[3-(Pyridin-2-ylamino)-propoxy]-10,11-dihydro-5H-dibenzo[a,d]cyclohepten-10-yl}-acetic acid
TypeSmall organic molecule
Emp. Form.C25H26N2O3
Mol. Mass.402.4855
SMILESOC(=O)C[C@H]1Cc2ccc(OCCCNc3ccccn3)cc2Cc2ccccc12