Reaction Details
TargetIntegrin alpha-IIb/beta-3
LigandBDBM50078714
Substrate/Competitorn/a
Meas. Tech.ChEBML_218230
Ki 9000±n/a nM
Citation Miller, WHBondinell, WECousins, RDErhard, KFJakas, DRKeenan, RMKu, TWNewlander, KARoss, STHaltiwanger, RCBradbeer, JDrake, FHGowen, MHoffman, SJHwang, SMJames, IELark, MWLechowska, BRieman, DJStroup, GBVasko-Moser, JAZembryki, DLAzzarano, LMAdams, PCHuffman, WF Orally bioavailable nonpeptide vitronectin receptor antagonists with efficacy in an osteoporosis model. Bioorg Med Chem Lett9:1807-12 (1999) Integrin alpha-IIb/beta-3
Name:Integrin alpha-IIb/beta-3
Synonyms:Glycoprotein IIb/IIIa
Type:n/a
Mol. Mass.:n/a
Description:ASSAY_ID of EBI is 30109
Components:This complex has 2 components.
Component 1
Name:Integrin beta-3
Type:Protein
Mol. Mass.:87038.91
Organism:Homo sapiens (Human)
Description:P05106
Residue:788
Component 2
Name:Integrin alpha-IIb
Synonyms:CD_antigen=CD41 GPIIb Glycoprotein IIb ITGA2B Integrin alpha-IIb heavy chain Integrin alpha-IIb light chain, form 2 Integrin alpha-V/beta-3 and alpha-IIb/beta 3 | Platelet membrane glycoprotein IIb
Type:Protein
Mol. Mass.:113354.85
Organism:Homo sapiens (Human)
Description:P08514
Residue:1039
BDBM50078714
NameBDBM50078714
Synonyms:CHEMBL288493 {(S)-3-[3-(Pyridin-2-ylamino)-propoxy]-10,11-dihydro-5H-dibenzo[a,d]cyclohepten-10-yl}-acetic acid | {3-[3-(Pyridin-2-ylamino)-propoxy]-10,11-dihydro-5H-dibenzo[a,d]cyclohepten-10-yl}-acetic acid
TypeSmall organic molecule
Emp. Form.C25H26N2O3
Mol. Mass.402.4855
SMILESOC(=O)C[C@@H]1Cc2ccc(OCCCNc3ccccn3)cc2Cc2ccccc12