Reaction Details
TargetSerine/threonine-protein kinase mTOR
LigandBDBM7886
Substrate/Competitorn/a
Meas. Tech.ChEMBL_66262 (CHEMBL679966)
Kd>10000000±n/a nM
Citation Muegge, IMartin, YCHajduk, PJFesik, SW Evaluation of PMF scoring in docking weak ligands to the FK506 binding protein. J Med Chem42:2498-503 (1999) 
 
Serine/threonine-protein kinase mTOR
Name:Serine/threonine-protein kinase mTOR
Type:Rapamycin target protein
Mol. Mass.:288917.12
Organism:Homo sapiens (Human)
Description:P42345
Residue:2549
BDBM7886
NameBDBM7886
Synonyms:1-PIM 1-phenylimidazole US9138393, 1-Phenyl- imidazole | US9144538, 1-Phenylimidazole
TypeSmall organic molecule
Emp. Form.C9H8N2
Mol. Mass.144.1732
SMILESc1cn(cn1)-c1ccccc1