Reaction Details
TargetMatrix metalloproteinase-9
LigandBDBM50078937
Substrate/Competitorn/a
Meas. Tech.ChEMBL_105378 (CHEMBL712457)
Ki 6±n/a nM
Citation Vassiliou, SMucha, ACuniasse, PGeorgiadis, DLucet-Levannier, KBeau, FKannan, RMurphy, GKnäuper, VRio, MCBasset, PYiotakis, ADive, V Phosphinic pseudo-tripeptides as potent inhibitors of matrix metalloproteinases: a structure-activity study. J Med Chem42:2610-20 (1999) 
 
Matrix metalloproteinase-9
Name:Matrix metalloproteinase-9
Type:Enzyme
Mol. Mass.:78452.28
Organism:Homo sapiens (Human)
Description:P14780
Residue:707
BDBM50078937
NameBDBM50078937
Synonyms:(1-Benzyloxycarbonylamino-ethyl)-{3-benzylsulfanyl-2-[1-carbamoyl-2-(1H-indol-3-yl)-ethylcarbamoyl]-propyl}-phosphinic acid | CHEMBL90622
TypeSmall organic molecule
Emp. Form.C32H37N4O6PS
Mol. Mass.636.698
SMILESCC(NC(=O)OCc1ccccc1)P(O)(=O)CC(CSCc1ccccc1)C(=O)NC(Cc1c[nH]c2ccccc12)C(N)=O