Reaction Details
TargetMatrilysin
LigandBDBM50078936
Substrate/Competitorn/a
Meas. Tech.ChEMBL_105050 (CHEMBL711564)
Ki 4±n/a nM
Citation Vassiliou, SMucha, ACuniasse, PGeorgiadis, DLucet-Levannier, KBeau, FKannan, RMurphy, GKnäuper, VRio, MCBasset, PYiotakis, ADive, V Phosphinic pseudo-tripeptides as potent inhibitors of matrix metalloproteinases: a structure-activity study. J Med Chem42:2610-20 (1999) 
 
Matrilysin
Name:Matrilysin
Type:Enzyme
Mol. Mass.:29681.54
Organism:Homo sapiens (Human)
Description:P09237
Residue:267
BDBM50078936
NameBDBM50078936
Synonyms:CHEMBL87786 | {2-[(2-Amino-1-carbamoyl-ethyl)-(2,4-dinitro-phenyl)-carbamoyl]-4-phenyl-butyl}-(1-benzyloxycarbonylamino-2-phenyl-ethyl)-phosphinic acid
TypeSmall organic molecule
Emp. Form.C36H39N6O10P
Mol. Mass.746.7028
SMILESNCC(N(C(=O)C(CCc1ccccc1)C[P+](O)([O-])C(Cc1ccccc1)NC(=O)OCc1ccccc1)c1ccc(cc1[N+]([O-])=O)[N+]([O-])=O)C(N)=O