Reaction Details
TargetStromelysin-3
LigandBDBM50078943
Substrate/Competitorn/a
Meas. Tech.ChEMBL_106454 (CHEMBL716816)
Ki 20±n/a nM
Citation Vassiliou, SMucha, ACuniasse, PGeorgiadis, DLucet-Levannier, KBeau, FKannan, RMurphy, GKnäuper, VRio, MCBasset, PYiotakis, ADive, V Phosphinic pseudo-tripeptides as potent inhibitors of matrix metalloproteinases: a structure-activity study. J Med Chem42:2610-20 (1999) 
 
Stromelysin-3
Name:Stromelysin-3
Type:PROTEIN
Mol. Mass.:55452.62
Organism:Mus musculus
Description:ChEMBL_106453
Residue:492
BDBM50078943
NameBDBM50078943
Synonyms:(1-Acetylamino-2-phenyl-ethyl)-{2-[1-carbamoyl-2-(1H-indol-3-yl)-ethylcarbamoyl]-5-phenyl-pentyl}-phosphinic acid | CHEMBL316200
TypeSmall organic molecule
Emp. Form.C33H39N4O5P
Mol. Mass.602.6603
SMILESCC(=O)NC(Cc1ccccc1)P(O)(=O)CC(CCCc1ccccc1)C(=O)NC(Cc1c[nH]c2ccccc12)C(N)=O