Reaction Details
TargetStromelysin-3
LigandBDBM50078933
Substrate/Competitorn/a
Meas. Tech.ChEMBL_106454 (CHEMBL716816)
Ki 8.8±n/a nM
Citation Vassiliou, SMucha, ACuniasse, PGeorgiadis, DLucet-Levannier, KBeau, FKannan, RMurphy, GKnäuper, VRio, MCBasset, PYiotakis, ADive, V Phosphinic pseudo-tripeptides as potent inhibitors of matrix metalloproteinases: a structure-activity study. J Med Chem42:2610-20 (1999) 
 
Stromelysin-3
Name:Stromelysin-3
Type:PROTEIN
Mol. Mass.:55452.62
Organism:Mus musculus
Description:ChEMBL_106453
Residue:492
BDBM50078933
NameBDBM50078933
Synonyms:(1-Benzyloxycarbonylamino-2-phenyl-ethyl)-{2-[1-carbamoyl-2-(1H-indol-3-yl)-ethylcarbamoyl]-4-phenyl-butyl}-phosphinic acid | CHEMBL315901
TypeSmall organic molecule
Emp. Form.C38H41N4O6P
Mol. Mass.680.7291
SMILESNC(=O)C(Cc1c[nH]c2ccccc12)NC(=O)C(CCc1ccccc1)CP(O)(=O)C(Cc1ccccc1)NC(=O)OCc1ccccc1