Reaction Details
TargetStromelysin-3
LigandBDBM50078928
Substrate/Competitorn/a
Meas. Tech.ChEMBL_106454 (CHEMBL716816)
Ki 15±n/a nM
Citation Vassiliou, SMucha, ACuniasse, PGeorgiadis, DLucet-Levannier, KBeau, FKannan, RMurphy, GKnäuper, VRio, MCBasset, PYiotakis, ADive, V Phosphinic pseudo-tripeptides as potent inhibitors of matrix metalloproteinases: a structure-activity study. J Med Chem42:2610-20 (1999) 
 
Stromelysin-3
Name:Stromelysin-3
Type:PROTEIN
Mol. Mass.:55452.62
Organism:Mus musculus
Description:ChEMBL_106453
Residue:492
BDBM50078928
NameBDBM50078928
Synonyms:(2-{N-[1-Carbamoyl-2-(1H-indol-3-yl)-ethyl]-hydrazinocarbonyl}-5-phenyl-pentyl)-[2-phenyl-1-(2-phenylamino-acetylamino)-ethyl]-phosphinic acid | CHEMBL87300
TypeSmall organic molecule
Emp. Form.C39H45N6O5P
Mol. Mass.708.7856
SMILESNN(C(Cc1c[nH]c2ccccc12)C(N)=O)C(=O)C(CCCc1ccccc1)CP(O)(=O)C(Cc1ccccc1)NC(=O)CNc1ccccc1