Reaction Details
TargetNeutrophil collagenase
LigandBDBM50078951
Substrate/Competitorn/a
Meas. Tech.ChEMBL_105814 (CHEMBL717814)
Ki 2.5±n/a nM
Citation Vassiliou, SMucha, ACuniasse, PGeorgiadis, DLucet-Levannier, KBeau, FKannan, RMurphy, GKnäuper, VRio, MCBasset, PYiotakis, ADive, V Phosphinic pseudo-tripeptides as potent inhibitors of matrix metalloproteinases: a structure-activity study. J Med Chem42:2610-20 (1999) 
 
Neutrophil collagenase
Name:Neutrophil collagenase
Type:Enzyme
Mol. Mass.:53413.48
Organism:Homo sapiens (Human)
Description:P22894
Residue:467
BDBM50078951
NameBDBM50078951
Synonyms:CHEMBL87159 | [1-(2-Benzyloxy-acetylamino)-2-phenyl-ethyl]-{2-[1-carbamoyl-2-(1H-indol-3-yl)-ethylcarbamoyl]-5-phenyl-pentyl}-phosphinic acid
TypeSmall organic molecule
Emp. Form.C40H45N4O6P
Mol. Mass.708.7823
SMILESNC(=O)C(Cc1c[nH]c2ccccc12)NC(=O)C(CCCc1ccccc1)CP(O)(=O)C(Cc1ccccc1)NC(=O)COCc1ccccc1