Reaction Details
TargetSerine protease 1
LigandBDBM50079243
Substrate/Competitorn/a
Meas. Tech.ChEMBL_212878 (CHEMBL824706)
Ki 350±n/a nM
Citation Quan, MLEllis, CDLiauw, AYAlexander, RSKnabb, RMLam, GWright, MRWong, PCWexler, RR Design and synthesis of isoxazoline derivatives as factor Xa inhibitors. 2. J Med Chem42:2760-73 (1999) 
 
Serine protease 1
Name:Serine protease 1
Type:Enzyme
Mol. Mass.:26557.80
Organism:Homo sapiens (Human)
Description:P07477
Residue:247
BDBM50079243
NameBDBM50079243
Synonyms:3-(3-Carbamimidoyl-phenyl)-5-ethylsulfanylmethyl-4,5-dihydro-isoxazole-5-carboxylic acid [5-(2-sulfamoyl-phenyl)-pyrimidin-2-yl]-amide; TFA | CHEMBL316311
TypeSmall organic molecule
Emp. Form.C24H25N7O4S2
Mol. Mass.539.63
SMILESCCSCC1(CC(=NO1)c1cccc(c1)C(N)=N)C(=O)Nc1ncc(cn1)-c1ccccc1S(N)(=O)=O