Reaction Details
TargetCoagulation factor X
LigandBDBM50079232
Substrate/Competitorn/a
Meas. Tech.ChEMBL_49167 (CHEMBL663266)
Ki 1.7±n/a nM
Citation Quan, MLEllis, CDLiauw, AYAlexander, RSKnabb, RMLam, GWright, MRWong, PCWexler, RR Design and synthesis of isoxazoline derivatives as factor Xa inhibitors. 2. J Med Chem42:2760-73 (1999) 
 
Coagulation factor X
Name:Coagulation factor X
Type:Enzyme
Mol. Mass.:54726.60
Organism:Homo sapiens (Human)
Description:n/a
Residue:488
BDBM50079232
NameBDBM50079232
Synonyms:3-(3-Carbamimidoyl-phenyl)-5-ethanesulfonylmethyl-4,5-dihydro-isoxazole-5-carboxylic acid [5-(2-sulfamoyl-phenyl)-pyridin-2-yl]-amide; TFA | CHEMBL93744
TypeSmall organic molecule
Emp. Form.C25H26N6O6S2
Mol. Mass.570.641
SMILESCCS(=O)(=O)CC1(CC(=NO1)c1cccc(c1)C(N)=N)C(=O)Nc1ccc(cn1)-c1ccccc1S(N)(=O)=O