Reaction Details
TargetSerine protease 1
LigandBDBM50079251
Substrate/Competitorn/a
Meas. Tech.ChEMBL_212878 (CHEMBL824706)
Ki 49±n/a nM
Citation Quan, MLEllis, CDLiauw, AYAlexander, RSKnabb, RMLam, GWright, MRWong, PCWexler, RR Design and synthesis of isoxazoline derivatives as factor Xa inhibitors. 2. J Med Chem42:2760-73 (1999) 
 
Serine protease 1
Name:Serine protease 1
Type:Enzyme
Mol. Mass.:26557.80
Organism:Homo sapiens (Human)
Description:P07477
Residue:247
BDBM50079251
NameBDBM50079251
Synonyms:3-(3-Carbamimidoyl-phenyl)-5-tetrazol-1-ylmethyl-4,5-dihydro-isoxazole-5-carboxylic acid (2'-methylsulfamoyl-biphenyl-4-yl)-amide; TFA | CHEMBL321530
TypeSmall organic molecule
Emp. Form.C26H25N9O4S
Mol. Mass.559.6
SMILESCNS(=O)(=O)c1ccccc1-c1ccc(NC(=O)C2(Cn3cnnn3)CC(=NO2)c2cccc(c2)C(N)=N)cc1