Reaction Details
TargetProthrombin
LigandBDBM50079254
Substrate/Competitorn/a
Meas. Tech.ChEMBL_208541 (CHEMBL813635)
Ki 70±n/a nM
Citation Quan, MLEllis, CDLiauw, AYAlexander, RSKnabb, RMLam, GWright, MRWong, PCWexler, RR Design and synthesis of isoxazoline derivatives as factor Xa inhibitors. 2. J Med Chem42:2760-73 (1999) 
 
Prothrombin
Name:Prothrombin
Type:Protein
Mol. Mass.:70029.57
Organism:Homo sapiens (Human)
Description:P00734
Residue:622
BDBM50079254
NameBDBM50079254
Synonyms:3-(3-Carbamimidoyl-phenyl)-5-tetrazol-1-ylmethyl-4,5-dihydro-isoxazole-5-carboxylic acid (2'-propylsulfamoyl-biphenyl-4-yl)-amide; TFA | CHEMBL264626
TypeSmall organic molecule
Emp. Form.C28H29N9O4S
Mol. Mass.587.653
SMILESCCCNS(=O)(=O)c1ccccc1-c1ccc(NC(=O)C2(Cn3cnnn3)CC(=NO2)c2cccc(c2)C(N)=N)cc1