Reaction Details
TargetSerine protease 1
LigandBDBM50079253
Substrate/Competitorn/a
Meas. Tech.ChEMBL_212878 (CHEMBL824706)
Ki 500±n/a nM
Citation Quan, MLEllis, CDLiauw, AYAlexander, RSKnabb, RMLam, GWright, MRWong, PCWexler, RR Design and synthesis of isoxazoline derivatives as factor Xa inhibitors. 2. J Med Chem42:2760-73 (1999) 
 
Serine protease 1
Name:Serine protease 1
Type:Enzyme
Mol. Mass.:26557.80
Organism:Homo sapiens (Human)
Description:P07477
Residue:247
BDBM50079253
NameBDBM50079253
Synonyms:3-(3-Carbamimidoyl-phenyl)-5-tetrazol-1-ylmethyl-4,5-dihydro-isoxazole-5-carboxylic acid [5-(2-sulfamoyl-phenyl)-pyrimidin-2-yl]-amide; TFA CHEMBL327331
TypeSmall organic molecule
Emp. Form.C23H21N11O4S
Mol. Mass.547.549
SMILESNC(=N)c1cccc(c1)C1=NOC(Cn2cnnn2)(C1)C(=O)Nc1ncc(cn1)-c1ccccc1S(N)(=O)=O