Reaction Details
TargetProthrombin
LigandBDBM50079246
Substrate/Competitorn/a
Meas. Tech.ChEMBL_208541 (CHEMBL813635)
Ki 3400±n/a nM
Citation Quan, MLEllis, CDLiauw, AYAlexander, RSKnabb, RMLam, GWright, MRWong, PCWexler, RR Design and synthesis of isoxazoline derivatives as factor Xa inhibitors. 2. J Med Chem42:2760-73 (1999) 
 
Prothrombin
Name:Prothrombin
Type:Protein
Mol. Mass.:70029.57
Organism:Homo sapiens (Human)
Description:P00734
Residue:622
BDBM50079246
NameBDBM50079246
Synonyms:3-(3-Carbamimidoyl-phenyl)-5-[1,2,4]triazol-1-ylmethyl-4,5-dihydro-isoxazole-5-carboxylic acid (2'-sulfamoyl-biphenyl-4-yl)-amide; TFA | CHEMBL436684
TypeSmall organic molecule
Emp. Form.C26H24N8O4S
Mol. Mass.544.585
SMILESNC(=N)c1cccc(c1)C1=NOC(Cn2cncn2)(C1)C(=O)Nc1ccc(cc1)-c1ccccc1S(N)(=O)=O