Reaction Details
TargetProthrombin
LigandBDBM50079236
Substrate/Competitorn/a
Meas. Tech.ChEMBL_208541 (CHEMBL813635)
Ki 900±n/a nM
Citation Quan, MLEllis, CDLiauw, AYAlexander, RSKnabb, RMLam, GWright, MRWong, PCWexler, RR Design and synthesis of isoxazoline derivatives as factor Xa inhibitors. 2. J Med Chem42:2760-73 (1999) 
 
Prothrombin
Name:Prothrombin
Type:Protein
Mol. Mass.:70029.57
Organism:Homo sapiens (Human)
Description:P00734
Residue:622
BDBM50079236
NameBDBM50079236
Synonyms:3-(3-Carbamimidoyl-phenyl)-5-tetrazol-1-ylmethyl-4,5-dihydro-isoxazole-5-carboxylic acid (2'-sulfamoyl-biphenyl-4-yl)-amide; TFA CHEMBL328069
TypeSmall organic molecule
Emp. Form.C25H23N9O4S
Mol. Mass.545.573
SMILESNC(=N)c1cccc(c1)C1=NOC(Cn2cnnn2)(C1)C(=O)Nc1ccc(cc1)-c1ccccc1S(N)(=O)=O