Reaction Details
TargetCoagulation factor X
LigandBDBM50079241
Substrate/Competitorn/a
Meas. Tech.ChEMBL_49167 (CHEMBL663266)
Ki 8.5±n/a nM
Citation Quan, MLEllis, CDLiauw, AYAlexander, RSKnabb, RMLam, GWright, MRWong, PCWexler, RR Design and synthesis of isoxazoline derivatives as factor Xa inhibitors. 2. J Med Chem42:2760-73 (1999) 
 
Coagulation factor X
Name:Coagulation factor X
Type:Enzyme
Mol. Mass.:54726.60
Organism:Homo sapiens (Human)
Description:n/a
Residue:488
BDBM50079241
NameBDBM50079241
Synonyms:5-Benzyl-3-(3-carbamimidoyl-phenyl)-4,5-dihydro-isoxazole-5-carboxylic acid (2'-sulfamoyl-biphenyl-4-yl)-amide; TFA | CHEMBL316070
TypeSmall organic molecule
Emp. Form.C30H27N5O4S
Mol. Mass.553.631
SMILESNC(=N)c1cccc(c1)C1=NOC(Cc2ccccc2)(C1)C(=O)Nc1ccc(cc1)-c1ccccc1S(N)(=O)=O