Reaction Details
TargetProthrombin
LigandBDBM50079250
Substrate/Competitorn/a
Meas. Tech.ChEMBL_208541 (CHEMBL813635)
Ki 300±n/a nM
Citation Quan, MLEllis, CDLiauw, AYAlexander, RSKnabb, RMLam, GWright, MRWong, PCWexler, RR Design and synthesis of isoxazoline derivatives as factor Xa inhibitors. 2. J Med Chem42:2760-73 (1999) 
 
Prothrombin
Name:Prothrombin
Type:Protein
Mol. Mass.:70029.57
Organism:Homo sapiens (Human)
Description:P00734
Residue:622
BDBM50079250
NameBDBM50079250
Synonyms:3-(3-Carbamimidoyl-phenyl)-5-tetrazol-1-ylmethyl-4,5-dihydro-isoxazole-5-carboxylic acid (3-methyl-2'-sulfamoyl-biphenyl-4-yl)-amide; TFA | CHEMBL329460
TypeSmall organic molecule
Emp. Form.C26H25N9O4S
Mol. Mass.559.6
SMILESCc1cc(ccc1NC(=O)C1(Cn2cnnn2)CC(=NO1)c1cccc(c1)C(N)=N)-c1ccccc1S(N)(=O)=O