Reaction Details
TargetIntegrin alpha-V/beta-3
LigandBDBM50079440
Substrate/Competitorn/a
Meas. Tech.ChEMBL_214639 (CHEMBL819719)
IC50 0.58±n/a nM
Citation Dechantsreiter, MAPlanker, EMathä, BLohof, EHölzemann, GJonczyk, AGoodman, SLKessler, H N-Methylated cyclic RGD peptides as highly active and selective alpha(V)beta(3) integrin antagonists. J Med Chem42:3033-40 (1999) 
 
Integrin alpha-V/beta-3
Name:Integrin alpha-V/beta-3
Type:Enzyme
Mol. Mass.:n/a
Description:n/a
Components:This complex has 2 components.
Component 1
Name:Integrin alpha-V
Synonyms:ITAV_HUMAN Integrin alpha-V/alpha-5 VNRA Vitronectin receptor | Vitronectin receptor subunit alpha
Type:PROTEIN
Mol. Mass.:116024.92
Organism:Homo sapiens (Human)
Description:ChEMBL_582336
Residue:1048
Component 2
Name:Integrin beta-3
Synonyms:CD_antigen=CD61 GPIIIa ITGB3 Platelet membrane glycoprotein IIIa
Type:Protein
Mol. Mass.:87038.91
Organism:Homo sapiens (Human)
Description:P05106
Residue:788
BDBM50079440
NameBDBM50079440
Synonyms:CHEMBL103214 | [(2R,5R,8R,11S)-5-Benzyl-11-(3-guanidino-propyl)-8-isopropyl-7-methyl-3,6,9,12,15-pentaoxo-1,4,7,10,13pentaaza-cyclopentadec-2-yl]-acetic acid
TypeSmall organic molecule
Emp. Form.C27H40N8O7
Mol. Mass.588.6559
SMILESCC(C)[C@H]1N(C)C(=O)[C@@H](Cc2ccccc2)NC(=O)[C@@H](CC(O)=O)NC(=O)CNC(=O)[C@H](CCCNC(N)=N)NC1=O