Reaction Details
TargetVasopressin V1b receptor
LigandBDBM50205304
Substrate/Competitorn/a
Meas. Tech.ChEMBL_1895468 (CHEMBL4397503)
EC50 24±n/a nM
Citation Wi?niewski, KQi, SKraus, JLy, BSrinivasan, KTariga, HCroston, GLa, EWi?niewska, HOrtiz, CLaporte, RRivière, PJNeyer, GHargrove, DMSchteingart, CD Discovery of Potent, Selective, and Short-Acting Peptidic V J Med Chem62:4991-5005 (2019) 
 
Vasopressin V1b receptor
Name:Vasopressin V1b receptor
Type:Enzyme
Mol. Mass.:46985.01
Organism:Homo sapiens (Human)
Description:P47901
Residue:424
BDBM50205304
NameBDBM50205304
Synonyms:CHEMBL435323 | dVDAVP
TypeSmall organic molecule
Emp. Form.C46H65N13O11S2
Mol. Mass.1040.219
SMILES[#6]-[#6](-[#6])-[#6@@H]-1-[#7]-[#6](=O)-[#6@H](-[#6]-c2ccccc2)-[#7]-[#6](=O)-[#6@H](-[#6]-c2ccc(-[#8])cc2)-[#7]-[#6](=O)-[#6]-[#6]-[#16]-[#16]-[#6]-[#6@H](-[#7]-[#6](=O)-[#6@H](-[#6]-[#6](-[#7])=O)-[#7]-[#6]-1=O)-[#6](=O)-[#7]-1-[#6]-[#6]-[#6]-[#6@H]-1-[#6](=O)-[#7]-[#6@H](-[#6]-[#6]-[#6]\[#7]=[#6](\[#7])-[#7])-[#6](=O)-[#7]-[#6]-[#6](-[#7])=O