Reaction Details
TargetVasopressin V1b receptor
LigandBDBM50205308
Substrate/Competitorn/a
Meas. Tech.ChEMBL_1895468 (CHEMBL4397503)
EC50 11±n/a nM
Citation Wi?niewski, KQi, SKraus, JLy, BSrinivasan, KTariga, HCroston, GLa, EWi?niewska, HOrtiz, CLaporte, RRivière, PJNeyer, GHargrove, DMSchteingart, CD Discovery of Potent, Selective, and Short-Acting Peptidic V J Med Chem62:4991-5005 (2019) 
 
Vasopressin V1b receptor
Name:Vasopressin V1b receptor
Type:Enzyme
Mol. Mass.:46985.01
Organism:Homo sapiens (Human)
Description:P47901
Residue:424
BDBM50205308
NameBDBM50205308
Synonyms:(S)-1-((4R,7S,10S,13S,16S)-7-(2-amino-2-oxoethyl)-10-(3-amino-3-oxopropyl)-13-benzyl-16-(4-hydroxybenzyl)-6,9,12,15,18-pentaoxo-1,2-dithia-5,8,11,14,17-pentaazacycloicosane-4-carbonyl)-N-((R)-1-(2-amino-2-oxoethylamino)-5-guanidino-1-oxopentan-2-yl)pyrrolidine-2-carboxamide DESMOPRESSIN dDAVP
TypeSmall organic molecule
Emp. Form.C46H64N14O12S2
Mol. Mass.1069.217
SMILES[#7]-[#6](=O)-[#6]-[#6]-[#6@@H]-1-[#7]-[#6](=O)-[#6@H](-[#6]-c2ccccc2)-[#7]-[#6](=O)-[#6@H](-[#6]-c2ccc(-[#8])cc2)-[#7]-[#6](=O)-[#6]-[#6]-[#16]-[#16]-[#6]-[#6@H](-[#7]-[#6](=O)-[#6@H](-[#6]-[#6](-[#7])=O)-[#7]-[#6]-1=O)-[#6](=O)-[#7]-1-[#6]-[#6]-[#6]-[#6@H]-1-[#6](=O)-[#7]-[#6@H](-[#6]-[#6]-[#6]\[#7]=[#6](\[#7])-[#7])-[#6](=O)-[#7]-[#6]-[#6](-[#7])=O