Reaction Details
TargetVasopressin V1b receptor
LigandBDBM301694
Substrate/Competitorn/a
Meas. Tech.ChEMBL_1895468 (CHEMBL4397503)
EC50 46±n/a nM
Citation Wi?niewski, KQi, SKraus, JLy, BSrinivasan, KTariga, HCroston, GLa, EWi?niewska, HOrtiz, CLaporte, RRivière, PJNeyer, GHargrove, DMSchteingart, CD Discovery of Potent, Selective, and Short-Acting Peptidic V J Med Chem62:4991-5005 (2019) 
 
Vasopressin V1b receptor
Name:Vasopressin V1b receptor
Type:Enzyme
Mol. Mass.:46985.01
Organism:Homo sapiens (Human)
Description:P47901
Residue:424
BDBM301694
NameBDBM301694
Synonyms:US10131692, Compound 26
TypeSmall organic molecule
Emp. Form.C49H71ClN12O9S
Mol. Mass.1039.681
SMILESCC(C)CNC(=O)[C@@H](CCCNC(N)=N)NC(=O)[C@@H]1CCCN1C(=O)[C@@H]1CCSCCC(=O)N[C@@H](Cc2ccc(Cl)cc2)C(=O)N[C@@H](Cc2ccccc2)C(=O)N[C@@H](C(C)C)C(=O)N[C@@H](CC(N)=O)C(=O)N1