Reaction Details
Target5-hydroxytryptamine receptor 1B
LigandBDBM50079939
Substrate/Competitorn/a
Meas. Tech.ChEMBL_1394 (CHEMBL832874)
Ki>1000±n/a nM
Citation Birch, AMBradley, PAGill, JCKerrigan, FNeedham, PL N-Substituted (2,3-dihydro-1,4-benzodioxin-2-yl)methylamine derivatives as D(2) antagonists/5-HT(1A) partial agonists with potential as atypical antipsychotic agents. J Med Chem42:3342-55 (1999) 
 
5-hydroxytryptamine receptor 1B
Name:5-hydroxytryptamine receptor 1B
Type:PROTEIN
Mol. Mass.:16950.74
Organism:Sus scrofa
Description:ChEMBL_1394
Residue:150
BDBM50079939
NameBDBM50079939
Synonyms:(7-Chloro-2,3-dihydro-benzo[1,4]dioxin-2-ylmethyl)-[1-(2-methoxy-phenyl)-piperidin-4-ylmethyl]-amine | CHEMBL418854
TypeSmall organic molecule
Emp. Form.C22H27ClN2O3
Mol. Mass.402.914
SMILESCOc1ccccc1N1CCC(CNCC2COc3ccc(Cl)cc3O2)CC1