Reaction Details
TargetNuclear receptor subfamily 1 group I member 2
LigandBDBM50030476
Substrate/Competitorn/a
Meas. Tech.ChEMBL_1897376 (CHEMBL4399411)
EC50 990±n/a nM
Citation Liang, DLi, LLynch, CDiethelm-Varela, BXia, MXue, FWang, H DL5050, a Selective Agonist for the Human Constitutive Androstane Receptor. ACS Med Chem Lett10:1039-1044 (2019) 
 
Nuclear receptor subfamily 1 group I member 2
Name:Nuclear receptor subfamily 1 group I member 2
Type:Nuclear receptor
Mol. Mass.:49774.77
Organism:Homo sapiens (Human)
Description:O75469
Residue:434
BDBM50030476
NameBDBM50030476
Synonyms:CHEMBL458603
TypeSmall organic molecule
Emp. Form.C19H12Cl3N3OS
Mol. Mass.436.742
SMILESClc1ccc(cc1)-c1nc2sccn2c1\C=N\OCc1ccc(Cl)c(Cl)c1