Reaction Details
TargetNuclear receptor subfamily 1 group I member 3
LigandBDBM50030476
Substrate/Competitorn/a
Meas. Tech.ChEMBL_1897372 (CHEMBL4399407)
EC50 620±n/a nM
Citation Liang, DLi, LLynch, CDiethelm-Varela, BXia, MXue, FWang, H DL5050, a Selective Agonist for the Human Constitutive Androstane Receptor. ACS Med Chem Lett10:1039-1044 (2019) 
 
Nuclear receptor subfamily 1 group I member 3
Name:Nuclear receptor subfamily 1 group I member 3
Type:PROTEIN
Mol. Mass.:39953.17
Organism:Homo sapiens (Human)
Description:ChEMBL_1434936
Residue:352
BDBM50030476
NameBDBM50030476
Synonyms:CHEMBL458603
TypeSmall organic molecule
Emp. Form.C19H12Cl3N3OS
Mol. Mass.436.742
SMILESClc1ccc(cc1)-c1nc2sccn2c1\C=N\OCc1ccc(Cl)c(Cl)c1