Reaction Details
TargetVoltage-dependent N-type calcium channel subunit alpha-1B
LigandBDBM50080309
Substrate/Competitorn/a
Meas. Tech.ChEBML_141323
IC50 190±n/a nM
Citation Ryder, TRHu, LYRafferty, MFLotarski, SMRock, DMStoehr, SJTaylor, CPWeber, MLMiljanich, GPMillerman, ESzoke, BG Structure-activity relationship at the proximal phenyl group in a series of non-peptidyl N-type calcium channel antagonists. Bioorg Med Chem Lett9:2453-8 (1999) Voltage-dependent N-type calcium channel subunit alpha-1B
Name:Voltage-dependent N-type calcium channel subunit alpha-1B
Type:Enzyme
Mol. Mass.:262548.16
Organism:Homo sapiens (Human)
Description:Q00975
Residue:2339
BDBM50080309
NameBDBM50080309
Synonyms:Azepane-1-carboxylic acid (1-{4-[(4-benzyloxy-phenyl)-(3-methyl-butyl)-amino]-piperidine-1-carbonyl}-3-methyl-butyl)-amide | CHEMBL80994
TypeSmall organic molecule
Emp. Form.C36H54N4O3
Mol. Mass.590.839
SMILESCC(C)CCN(C1CCN(CC1)C(=O)[C@H](CC(C)C)NC(=O)N1CCCCCC1)c1ccc(OCc2ccccc2)cc1