Reaction Details
TargetProtein kinase C delta type
LigandBDBM50080322
Substrate/Competitorn/a
Meas. Tech.ChEMBL_160931 (CHEMBL769094)
Ki 0.351±n/a nM
Citation Wang, SLiu, MLewin, NELorenzo, PSBhattacharrya, DQiao, LKozikowski, APBlumberg, PM Probing the binding of indolactam-V to protein kinase C through site-directed mutagenesis and computational docking simulations. J Med Chem42:3436-46 (1999) 
 
Protein kinase C delta type
Name:Protein kinase C delta type
Type:PROTEIN
Mol. Mass.:77554.99
Organism:Mus musculus
Description:ChEMBL_1351519
Residue:674
BDBM50080322
NameBDBM50080322
Synonyms:Acetic acid (1aR,1bS,4aR,7aS,7bS,8R,9R,9aS)-9-acetoxy-4a,7b-dihydroxy-3-hydroxymethyl-1,1,6,8-tetramethyl-5-oxo-1,1a,1b,4,4a,5,7a,7b,8,9-decahydro-cyclopropa[3,4]benzo[1,2-e]azulen-9a-yl ester | CHEMBL116437
TypeSmall organic molecule
Emp. Form.C24H32O8
Mol. Mass.448.5061
SMILESC[C@@H]1[C@@H](OC(C)=O)[C@]2(OC(C)=O)[C@H]([C@@H]3C=C(CO)C[C@@]4(O)[C@@H](C=C(C)C4=O)[C@@]13O)C2(C)C