Reaction Details
TargetPeptidyl-prolyl cis-trans isomerase FKBP1A
LigandBDBM50080528
Substrate/Competitorn/a
Meas. Tech.ChEMBL_66274 (CHEMBL678144)
Ki 3400±n/a nM
Citation Christner, CWyrwa, RMarsch, SKüllertz, GThiericke, RGrabley, SSchumann, DFischer, G Synthesis and cytotoxic evaluation of cycloheximide derivatives as potential inhibitors of FKBP12 with neuroregenerative properties. J Med Chem42:3615-22 (1999) 
 
Peptidyl-prolyl cis-trans isomerase FKBP1A
Name:Peptidyl-prolyl cis-trans isomerase FKBP1A
Type:Isomerase
Mol. Mass.:11953.09
Organism:Homo sapiens (Human)
Description:P62942
Residue:108
BDBM50080528
NameBDBM50080528
Synonyms:3-((R)-2-((1S,3S,5S)-3,5-dimethyl-2-oxocyclohexyl)-2-hydroxyethyl)glutarimide CHEMBL123292 Zykloheximid cycloheximide | med.21724, Compound Cycloheximide
TypeSmall organic molecule
Emp. Form.C15H23NO4
Mol. Mass.281.3474
SMILESC[C@H]1C[C@H](C)C(=O)[C@@H](C1)[C@H](O)CC1CC(=O)NC(=O)C1