Reaction Details
TargetCoagulation factor X
LigandBDBM50081092
Substrate/Competitorn/a
Meas. Tech.ChEMBL_160981 (CHEMBL769321)
IC50 9.9±n/a nM
Citation Tamura, SYGoldman, EABergum, PWSemple, JE Novel benzo-fused lactam scaffolds as factor Xa inhibitors. Bioorg Med Chem Lett9:2573-8 (1999) Coagulation factor X
Name:Coagulation factor X
Type:Enzyme
Mol. Mass.:54726.60
Organism:Homo sapiens (Human)
Description:n/a
Residue:488
BDBM50081092
NameBDBM50081092
Synonyms:CHEMBL85238 | N-((S)-1-Carbamimidoyl-2-hydroxy-piperidin-3-yl)-2-((S)-3-cyclohexylmethanesulfonylamino-7-methoxy-2-oxo-2,3,4,5-tetrahydro-benzo[b]azepin-1-yl)-acetamide; TFA
TypeSmall organic molecule
Emp. Form.C26H40N6O6S
Mol. Mass.564.697
SMILESCOc1ccc2N(CC(=O)N[C@H]3CCCN(C3O)C(N)=N)C(=O)[C@H](CCc2c1)NS(=O)(=O)CC1CCCCC1