Reaction Details
TargetrRNA adenine N-6-methyltransferase
LigandBDBM50081294
Substrate/Competitorn/a
Meas. Tech.ChEMBL_67531 (CHEMBL679968)
Ki 75000±n/a nM
Citation Hajduk, PJDinges, JSchkeryantz, JMJanowick, DKaminski, MTufano, MAugeri, DJPetros, ANienaber, VZhong, PHammond, RCoen, MBeutel, BKatz, LFesik, SW Novel inhibitors of Erm methyltransferases from NMR and parallel synthesis. J Med Chem42:3852-9 (1999) rRNA adenine N-6-methyltransferase
Name:rRNA adenine N-6-methyltransferase
Type:PROTEIN
Mol. Mass.:28804.82
Organism:Streptococcus pneumoniae
Description:ChEMBL_67532
Residue:245
BDBM50081294
NameBDBM50081294
Synonyms:CHEMBL125250 | N-Cyclohexyl-6-piperidin-1-yl-[1,3,5]triazine-2,4-diamine
TypeSmall organic molecule
Emp. Form.C14H24N6
Mol. Mass.276.3806
SMILESNc1nc(NC2CCCCC2)nc(n1)N1CCCCC1