Reaction Details
TargetProstaglandin E2 receptor EP1 subtype
LigandBDBM50081453
Substrate/Competitorn/a
Meas. Tech.ChEBML_158177
Ki 16±n/a nM
Citation Ruel, RLacombe, PAbramovitz, MGodbout, CLamontagne, SRochette, CSawyer, NStocco, RTremblay, NMMetters, KMLabelle, M New class of biphenylene dibenzazocinones as potent ligands for the human EP1 prostanoid receptor. Bioorg Med Chem Lett9:2699-704 (1999) Prostaglandin E2 receptor EP1 subtype
Name:Prostaglandin E2 receptor EP1 subtype
Type:Enzyme
Mol. Mass.:41834.57
Organism:Homo sapiens (Human)
Description:P34995
Residue:402
BDBM50081453
NameBDBM50081453
Synonyms:4'-(6-Oxo-11,12-dihydro-6H-dibenzo[b,f]azocin-5-ylmethyl)-biphenyl-2-sulfonic acid (2-phenyl-propionyl)-amide | CHEMBL90491
TypeSmall organic molecule
Emp. Form.C37H32N2O4S
Mol. Mass.600.726
SMILESCC(C(=O)NS(=O)(=O)c1ccccc1-c1ccc(CN2c3ccccc3CCc3ccccc3C2=O)cc1)c1ccccc1