Reaction Details
TargetProstaglandin E2 receptor EP3 subtype
LigandBDBM50081439
Substrate/Competitorn/a
Meas. Tech.ChEBML_158320
Ki 5000±n/a nM
Citation Ruel, RLacombe, PAbramovitz, MGodbout, CLamontagne, SRochette, CSawyer, NStocco, RTremblay, NMMetters, KMLabelle, M New class of biphenylene dibenzazocinones as potent ligands for the human EP1 prostanoid receptor. Bioorg Med Chem Lett9:2699-704 (1999) Prostaglandin E2 receptor EP3 subtype
Name:Prostaglandin E2 receptor EP3 subtype
Type:Enzyme
Mol. Mass.:43335.03
Organism:Homo sapiens (Human)
Description:P43115
Residue:390
BDBM50081439
NameBDBM50081439
Synonyms:CHEMBL92539 | sulfonylurea analogue
TypeSmall organic molecule
Emp. Form.C38H35N3O4S
Mol. Mass.629.767
SMILESCN(CCc1ccccc1)C(=O)NS(=O)(=O)c1ccccc1-c1ccc(CN2c3ccccc3CCc3ccccc3C2=O)cc1