Reaction Details
TargetProstaglandin E2 receptor EP1 subtype
LigandBDBM50081434
Substrate/Competitorn/a
Meas. Tech.ChEBML_158177
Ki 140±n/a nM
Citation Ruel, RLacombe, PAbramovitz, MGodbout, CLamontagne, SRochette, CSawyer, NStocco, RTremblay, NMMetters, KMLabelle, M New class of biphenylene dibenzazocinones as potent ligands for the human EP1 prostanoid receptor. Bioorg Med Chem Lett9:2699-704 (1999) Prostaglandin E2 receptor EP1 subtype
Name:Prostaglandin E2 receptor EP1 subtype
Type:Enzyme
Mol. Mass.:41834.57
Organism:Homo sapiens (Human)
Description:P34995
Residue:402
BDBM50081434
NameBDBM50081434
Synonyms:CHEMBL327597 | sulfonylurea analogue
TypeSmall organic molecule
Emp. Form.C37H33N3O4S
Mol. Mass.615.741
SMILESC[C@H](NC(=O)NS(=O)(=O)c1ccccc1-c1ccc(CN2c3ccccc3CCc3ccccc3C2=O)cc1)c1ccccc1