Reaction Details
TargetDipeptidase 1
LigandBDBM50042574
Substrate/Competitorn/a
Meas. Tech.ChEBML_53274
Ki 80000±n/a nM
Citation Toney, JHCleary, KAHammond, GGYuan, XMay, WJHutchins, SMAshton, WTVanderwall, DE Structure-activity relationships of biphenyl tetrazoles as metallo-beta-lactamase inhibitors. Bioorg Med Chem Lett9:2741-6 (1999) Dipeptidase 1
Name:Dipeptidase 1
Type:Enzyme Catalytic Domain
Mol. Mass.:44697.32
Organism:GUINEA PIG
Description:Leukotriene D4 Alpha 0 GUINEA PIG::P22412
Residue:409
BDBM50042574
NameBDBM50042574
Synonyms:5-Butyl-2-(2,5-dichloro-phenyl)-4-[2'-(1H-tetrazol-5-yl)-biphenyl-4-ylmethyl]-2H-pyrazole-3-carboxylic acid ethyl ester | CHEMBL329541
TypeSmall organic molecule
Emp. Form.C30H28Cl2N6O2
Mol. Mass.575.488
SMILESCCCCc1nn(c(C(=O)OCC)c1Cc1ccc(cc1)-c1ccccc1-c1nnn[nH]1)-c1cc(Cl)ccc1Cl