Reaction Details
TargetDipeptidase 1
LigandBDBM50042548
Substrate/Competitorn/a
Meas. Tech.ChEBML_53274
Ki 450000±n/a nM
Citation Toney, JHCleary, KAHammond, GGYuan, XMay, WJHutchins, SMAshton, WTVanderwall, DE Structure-activity relationships of biphenyl tetrazoles as metallo-beta-lactamase inhibitors. Bioorg Med Chem Lett9:2741-6 (1999) Dipeptidase 1
Name:Dipeptidase 1
Type:Enzyme Catalytic Domain
Mol. Mass.:44697.32
Organism:GUINEA PIG
Description:Leukotriene D4 Alpha 0 GUINEA PIG::P22412
Residue:409
BDBM50042548
NameBDBM50042548
Synonyms:5-Butyl-2-(3-chloro-phenyl)-4-[2'-(1H-tetrazol-5-yl)-biphenyl-4-ylmethyl]-2H-pyrazole-3-carboxylic acid ethyl ester | CHEMBL93289
TypeSmall organic molecule
Emp. Form.C30H29ClN6O2
Mol. Mass.541.043
SMILESCCCCc1nn(c(C(=O)OCC)c1Cc1ccc(cc1)-c1ccccc1-c1nnn[nH]1)-c1cccc(Cl)c1